﻿연령,성별,부서,라인,작업,현재_작업기간,이전_작업기간,육체적부담정도,목_2번,목_3번,목_4번,목_5번,목_6번,어깨_1번,어깨_2번,어깨_3번,어깨_4번,어깨_5번,어깨_6번,팔_1번,팔_2번,팔_3번,팔_4번,팔_5번,팔_6번,손_1번,손_2번,손_3번,손_4번,손_5번,손_6번,허리_2번,허리_3번,허리_4번,허리_5번,허리_6번,다리_1번,다리_2번,다리_3번,다리_4번,다리_5번,다리_6번
54,1,생산,도금,크롬도금,0.8,2,5,3,1,3,2,2,1,3,1,4,2,4,1,4,1,3,2,1,2,3,2,1,1,3,4,3,3,1,1,,,,,,
32,1,생산,도금,크롬도금,1.2,5,4,1,2,4,1,4,2,4,2,2,1,3,2,3,3,3,1,1,,,,,,,,,,,,,,,,,
64,1,생산,도금,크롬도금,10.5,10.5,4,2,3,1,2,2,3,4,3,3,2,1,3,1,2,4,2,2,2,3,3,2,2,1,,,,,,1,3,1,2,1,2
74,1,생산,도금,크롬도금,8.3,15,4,,,,,,1,3,3,3,1,1,1,1,3,3,1,3,,,,,,,,,,,,,,,,,
32,1,생산,도금,크롬도금,2.5,20,4,,,,,,2,2,1,2,2,2,2,2,2,4,2,2,,,,,,,4,2,4,2,1,,,,,,
68,1,생산,도금,크롬도금,6.7,32,3,,,,,,3,3,2,1,2,3,3,4,3,1,2,2,,,,,,,2,2,4,1,4,,,,,,
33,1,생산,도금,크롬도금,8.8,5.5,2,,,,,,1,3,2,3,2,4,1,1,3,1,2,3,,,,,,,,,,,,,,,,,
21,1,생산,도금,크롬도금,8.2,3,1,,,,,,2,1,1,4,1,1,2,4,1,1,1,3,,,,,,,3,1,3,2,2,,,,,,
37,1,생산,도금,크롬도금,1.2,2,2,,,,,,3,3,2,1,2,3,3,3,3,4,2,1,,,,,,,4,1,1,1,1,,,,,,
43,1,생산,도금,크롬도금,10.5,5,3,,,,,,1,3,2,1,1,1,1,2,2,2,1,4,,,,,,,,,,,,,,,,,
54,2,생산,도금,크롬도금,8.3,6,4,,,,,,1,4,3,2,2,4,1,4,2,4,2,2,3,4,2,4,1,1,,,,,,,,,,,
54,2,생산,도금,크롬도금,2.5,1,2,,,,,,2,2,2,2,1,1,2,2,3,4,1,4,,,,,,,,,,,,1,1,2,2,2,3
32,2,포장,포장1,전처리,6.7,2,3,,,,,,3,4,1,3,2,1,3,4,2,2,2,2,,,,,,,,,,,,,,,,,
64,2,포장,포장1,전처리,8.8,6.2,4,,,,,,1,4,3,3,2,4,1,2,2,4,2,2,2,3,1,4,2,3,,,,,,,,,,,
74,2,포장,포장1,전처리,8.2,6.8,4,,,,,,2,3,2,2,2,2,2,1,2,1,2,4,,,,,,,2,2,1,1,1,2,4,2,3,2,4
32,2,포장,포장1,후처리,1.2,8.5,3,,,,,,3,3,1,2,1,3,3,4,3,3,1,4,,,,,,,3,1,3,2,1,3,4,1,1,1,4
68,2,포장,포장1,후처리,10.5,3.2,3,,,,,,1,1,2,3,2,4,1,1,1,4,2,4,,,,,,,,,,,,,,,,,
33,1,포장,포장2,분류,8.3,14,2,,,,,,2,2,1,1,1,2,2,4,3,4,1,3,3,1,1,2,1,2,,,,,,,,,,,
21,1,포장,포장2,분류,2.5,11,2,,,,,,3,3,2,4,2,1,3,3,1,2,2,1,,,,,,,,,,,,,,,,,
37,1,포장,포장2,마무리,6.7,12,1,,,,,,1,3,1,3,1,2,1,3,2,4,1,4,2,4,3,3,2,3,,,,,,,,,,,
43,1,포장,포장2,마무리,8.8,15.4,1,,,,,,1,1,1,1,2,1,1,1,1,1,2,1,,,,,,,,,,,,,,,,,
